{"text_format":"1","workbook":"xlsx","n_sheets":7,"sheets":["MENU","Simulador","Tab Contr","Cálculo Participante","Mort Validos-Masc","Mort Validos-Fem","Plan1"],"not_rendered":{"charts":0,"images":4,"macros":1,"external_links":0,"defined_names":1,"comments":0,"pivot_tables":0},"unopened":[],"bounds":{"document_bytes":16777216,"sheet_cells":100000,"rows_first":2000,"rows_last":500,"rows_between":2000,"halvings":0,"cell_chars":16384,"cell_head_chars":4096},"cells_cut":0,"cells_raw":0,"read":"whole","date_system":"1900"}

{"sheet":"MENU","index":0,"n_rows":1,"n_cols":1,"rows_kept":1,"cut":false,"hidden":false,"merged":[[0,0,0,21],[1,0,35,21],[36,0,36,16383]]}
[{"$f":"TODAY()","v":"2015-09-11"}]

{"sheet":"Simulador","index":1,"n_rows":92,"n_cols":17,"rows_kept":92,"cut":false,"hidden":false,"merged":[[15,14,15,15],[33,1,33,9],[51,1,51,9],[52,1,61,1],[62,1,63,9],[58,7,59,8],[60,9,61,9],[45,1,46,7],[56,7,57,8],[36,1,37,9],[39,8,40,9],[41,8,42,9],[43,8,44,9],[39,1,40,7],[49,1,49,9],[32,8,32,9],[73,1,73,9],[79,1,79,9],[80,1,80,9],[75,9,76,9],[66,9,67,9],[60,7,61,8],[74,1,74,9],[38,1,38,9],[47,8,48,9],[47,1,48,7],[72,4,72,6],[52,2,53,6],[75,1,76,8],[81,1,82,8],[54,2,55,6],[56,2,57,6],[58,2,59,6],[60,2,61,6],[66,1,67,8],[68,1,69,8],[65,1,65,9],[77,9,78,9],[64,1,64,9],[56,9,59,9],[52,7,53,8],[6,1,7,6],[29,1,30,9],[10,9,11,9],[8,1,9,8],[10,1,11,8],[27,1,27,9],[0,0,0,10],[28,1,28,9],[43,1,44,7],[35,1,35,2],[54,7,55,8],[32,1,32,7],[34,1,34,9],[50,1,50,9],[45,8,46,9],[1,9,2,9],[1,1,2,8],[6,7,7,8],[13,1,13,9],[1,0,92,0],[4,9,5,9],[4,1,5,8],[92,1,92,9],[89,1,89,9],[88,1,88,9],[87,1,87,9],[77,1,78,8],[91,1,91,9],[90,1,90,9],[85,1,85,9],[83,9,84,9],[83,1,84,8],[3,1,3,9],[68,9,69,9],[81,9,82,9],[70,9,71,9],[12,1,12,9],[41,1,42,7],[70,1,71,8],[52,9,55,9],[6,9,7,9],[31,1,31,7],[17,7,25,9],[26,1,26,9],[8,9,9,9],[31,8,31,9],[14,1,15,9],[16,7,16,9]]}
["SIMULADOR DE BENEFÍCIO PLANO CD",null,null,null,null,null,null,null,null,null,null,{"$f":"TODAY()","v":"2015-09-11"}]
[null,"Unidade Previdenciária ECOS (UPE) =",null,null,null,null,null,null,null,157.66,null,null,null,null,false,1,"F"]
[null,null,null,null,null,null,null,null,null,null,null,null,null,null,true,2,"M"]
[null,"Dados de Entrada:",null,null,null,null,null,null,null,null,null,null,null,null,"CONSERVADOR - alocação de 100% da Conta de Participante na carteira Conservadora, composta por ativos enquadrados nos segmentos de Renda Fixa e Investimentos Estruturados, considerados de baixo risco e com baixa volatilidade de preço"]
[null,"Qual sua data de nascimento ? ",null,null,null,null,null,null,null,null,null,{"$f":"RIGHT(J5,4)","v":""},null,null,"ARROJADO 30 -  alocação de 30% da Conta de Participante na carteira Arrojada, composta por ativos enquadrados nos segmentos de Renda Variável, Investimentos Estruturados e Investimentos no Exterior - sujeitos à alta volatilidade de preço. O saldo remanescente é alocado no perfil conservador."]
[null,null,null,null,null,null,null,null,null,null,null,"IDADE ATUAL",null,null,"ARROJADO 40 - alocação de 40% da Conta de Participante na carteira Arrojada, composta por ativos enquadrados nos segmentos de Renda Variável, Investimentos Estruturados e Investimentos no Exterior - sujeitos à alta volatilidade de preço. O saldo remanescente é alocado no perfil conservador."]
[null,"Com qual idade deseja receber o benefício? (a partir de 60 anos)",null,null,null,null,null,{"$f":"IFERROR(IF(L7<=J7,\"\",\"IDADE Ñ PERMITIDA\"),\"\")","v":""},null,null,null,{"$f":"YEAR(L1)-L5","v":{"$error":"#VALUE!"}},null,null,"ARROJADO 50 - alocação de 50% da Conta de Participante na carteira Arrojada, composta por ativos enquadrados nos segmentos de Renda Variável, Investimentos Estruturados e Investimentos no Exterior - sujeitos à alta volatilidade de preço. O saldo remanescente é alocado no perfil conservador."]
[]
[null,"Qual o seu Salário Atual?",null,null,null,null,null,null,null,null,null,null,null,null,"Taxa Adm RF","Taxa Adm RV"]
[null,null,null,null,null,null,null,null,null,null,null,null,null,null,7.4999999999999997E-3,1.4999999999999999E-2]
[null,"Sexo (F/M) ="]
[null,null,null,null,null,null,null,null,null,null,null,null,null,null,"Saldo projetado =",{"$f":"IF(J7>=65,0,(65-'Cálculo Participante'!B10)*12*2*H53)","v":{"$error":"#VALUE!"}}]
[null,null,null,null,null,null,null,null,null,null,null,null,null,null,"Salário Mínimo = ",724]
[null,"Indique abaixo qual o seu Perfil de Investimento ",null,null,null,null,null,null,null,null,null,{"$f":"IF('Cálculo Participante'!B10>=60,G17=1,\"\")","v":""}]
[null,{"$f":"IFERROR(IF(L7=60,\"Sua idade é igual ou maior a 60 anos, escolha o Perfil CONSERVADOR - o regulamento do plano não permite que você tenha rentabilidade baseado em investimentos de renda variável \",\"\"),\"\")","v":""}]
[null,null,null,null,null,null,null,null,null,null,null,"PERFIL",null,null,"Percentuais alocação perfis"]
[null,null,null,null,null,null,1,"Seu Perfil é:",null,null,null,{"$f":"IF(L7>=60,1,G17)","v":{"$error":"#VALUE!"}},null,null,{"$f":"IF(G17=1,100%,IF(G17=2,70%,IF(G17=3,60%,50%)))","v":1},{"$f":"IF(G17=1,0%,IF(G17=2,30%,IF(G17=3,40%,50%)))","v":0}]
[null,null,null,null,null,null,null,{"$f":"IFERROR(IF(L17=1,O4,IF(G17=2,O5,IF(G17=3,O6,O7))),\"\")","v":""}]
[]
[]
[]
[]
[]
[]
[]
[]
[null,"Obs: O Perfil de Investimento pode ser alterado nos meses de junho e dezembro. Caso o participante não altere, fica mantida a última opção."]
[null,"Histórico de Rentabilidades"]
[null,"A título de informação complementar, elaboramos uma tabela com a rentabilidade real (o que exclui efeito da inflação) histórica de cada carteira. "]
[]
{"$rows_left_out":63}
{"sheet":"Tab Contr","index":2,"n_rows":57,"n_cols":17,"rows_kept":57,"cut":false,"hidden":false,"merged":[[9,7,9,8],[9,9,9,10],[9,11,9,12],[9,4,9,6],[1,1,1,3]]}
[null,"UPE =",{"$f":"Simulador!J2","v":157.66}]
[null,"Tabela de Contribuição",null,null,null,"RF","RV"]
[null,"SAL","SAL EM UPE","PERC",null,{"$f":"1-Simulador!O10","v":0.99250000000000005},{"$f":"1-Simulador!P10","v":0.98499999999999999}]
[null,null,{"$f":"C1*5-0.01","v":788.29},0.02]
[null,null,{"$f":"C1*15-0.01","v":2364.89},0.03]
[null,null,{"$f":"C1*25-0.01","v":3941.49},0.04]
[null,null,{"$f":"C1*50-0.01","v":7882.99},0.05]
[null,null,{"$f":"C1*50","v":7883},0.06]
[]
[{"$f":"IF(Simulador!J7-Simulador!L7<0,3,Simulador!J7-Simulador!L7)","v":{"$error":"#VALUE!"}},null,null,null,"Carteiras",null,null,"Adicional mensal",null,"Adicional trimestral",null,"Adicional semestral",null,"Adicional anual","Saldo Total"]
[null,null,"Contr mensal","Contr anual","RF","RV","Total","Contr adicional","No ano","Contr adicional","No ano","Contr adicional","No ano","Contr adicional","RF + RV"]
[1,{"$f":"Simulador!J9","v":0},{"$f":"2*IF(A12>$A$10,0,IF(B12<=$C$4,(B12*$D$4),IF(B12<=$C$5,(B12*$D$5),IF(B12<=$C$6,(B12*$D$6),IF(B12<=$C$7,(B12*$D$7),(B12*$D$8))))))","v":{"$error":"#VALUE!"}},{"$f":"12*C12","v":{"$error":"#VALUE!"}},{"$f":"(Simulador!O17*(D12+I12+K12+M12+N12+Simulador!I40))","v":{"$error":"#VALUE!"}},{"$f":"(Simulador!P17*(D12+I12+K12+M12+N12+Simulador!I40))","v":{"$error":"#VALUE!"}},{"$f":"E12+F12","v":{"$error":"#VALUE!"}},{"$f":"Simulador!I42","v":0},{"$f":"Simulador!$I$42*12","v":0},{"$f":"Simulador!I44","v":0},{"$f":"Simulador!$I$44*4","v":0},{"$f":"Simulador!I46","v":0},{"$f":"Simulador!$I$46*2","v":0},{"$f":"Simulador!I48","v":0},{"$f":"IF(A12=$A$10,G12,0)","v":{"$error":"#VALUE!"}}]
[2,{"$f":"B12*1.02","v":0},{"$f":"2*IF(A13>$A$10,0,IF(B13<=$C$4*1.02^A13,(B13*$D$4),IF(B13<=$C$5*1.02^A13,(B13*$D$5),IF(B13<=$C$6*1.02^A13,(B13*$D$6),IF(B13<=$C$7*1.02^A13,(B13*$D$7),(B13*$D$8))))))","v":{"$error":"#VALUE!"}},{"$f":"(C13*12)","v":{"$error":"#VALUE!"}},{"$f":"(E12*Simulador!$B$36*$F$3+Simulador!$O$17*(D13+I13+K13+M13+N13))","v":{"$error":"#VALUE!"}},{"$f":"(F12*Simulador!$D$36*$G$3+Simulador!$P$17*(D13+I13+K13+M13+N13))","v":{"$error":"#VALUE!"}},{"$f":"E13+F13","v":{"$error":"#VALUE!"}},{"$f":"H12*1.02","v":0},{"$f":"(H13*12)","v":0},{"$f":"J12*1.02","v":0},{"$f":"(J13*4)","v":0},{"$f":"L12*1.02","v":0},{"$f":"(L13*2)","v":0},{"$f":"N12*1.02","v":0},{"$f":"IF(A13=$A$10,G13,0)","v":{"$error":"#VALUE!"}}]
[{"$f":"A13+1","v":3},{"$f":"B13*1.02","v":0},{"$f":"2*IF(A14>$A$10,0,IF(B14<=$C$4*1.02^A14,(B14*$D$4),IF(B14<=$C$5*1.02^A14,(B14*$D$5),IF(B14<=$C$6*1.02^A14,(B14*$D$6),IF(B14<=$C$7*1.02^A14,(B14*$D$7),(B14*$D$8))))))","v":{"$error":"#VALUE!"}},{"$f":"(C14*12)","v":{"$error":"#VALUE!"}},{"$f":"(E13*Simulador!$B$36*$F$3+Simulador!$O$17*(D14+I14+K14+M14+N14))","v":{"$error":"#VALUE!"}},{"$f":"(F13*Simulador!$D$36*$G$3+Simulador!$P$17*(D14+I14+K14+M14+N14))","v":{"$error":"#VALUE!"}},{"$error":"#VALUE!"},{"$f":"H13*1.02","v":0},0,{"$f":"J13*1.02","v":0},{"$f":"(J14*4)","v":0},{"$f":"L13*1.02","v":0},{"$f":"(L14*2)","v":0},{"$f":"N13*1.02","v":0},{"$f":"IF(A14=$A$10,G14,0)","v":{"$error":"#VALUE!"}}]
[{"$f":"A14+1","v":4},{"$f":"B14*1.02","v":0},{"$f":"2*IF(A15>$A$10,0,IF(B15<=$C$4*1.02^A15,(B15*$D$4),IF(B15<=$C$5*1.02^A15,(B15*$D$5),IF(B15<=$C$6*1.02^A15,(B15*$D$6),IF(B15<=$C$7*1.02^A15,(B15*$D$7),(B15*$D$8))))))","v":{"$error":"#VALUE!"}},{"$error":"#VALUE!"},{"$f":"(E14*Simulador!$B$36*$F$3+Simulador!$O$17*(D15+I15+K15+M15+N15))","v":{"$error":"#VALUE!"}},{"$f":"(F14*Simulador!$D$36*$G$3+Simulador!$P$17*(D15+I15+K15+M15+N15))","v":{"$error":"#VALUE!"}},{"$error":"#VALUE!"},0,0,0,0,0,0,0,{"$error":"#VALUE!"}]
[5,0,{"$f":"2*IF(A16>$A$10,0,IF(B16<=$C$4*1.02^A16,(B16*$D$4),IF(B16<=$C$5*1.02^A16,(B16*$D$5),IF(B16<=$C$6*1.02^A16,(B16*$D$6),IF(B16<=$C$7*1.02^A16,(B16*$D$7),(B16*$D$8))))))","v":{"$error":"#VALUE!"}},{"$error":"#VALUE!"},{"$f":"(E15*Simulador!$B$36*$F$3+Simulador!$O$17*(D16+I16+K16+M16+N16))","v":{"$error":"#VALUE!"}},{"$f":"(F15*Simulador!$D$36*$G$3+Simulador!$P$17*(D16+I16+K16+M16+N16))","v":{"$error":"#VALUE!"}},{"$error":"#VALUE!"},0,0,0,0,0,0,0,{"$error":"#VALUE!"}]
[6,0,{"$error":"#VALUE!"},{"$error":"#VALUE!"},{"$f":"(E16*Simulador!$B$36*$F$3+Simulador!$O$17*(D17+I17+K17+M17+N17))","v":{"$error":"#VALUE!"}},{"$f":"(F16*Simulador!$D$36*$G$3+Simulador!$P$17*(D17+I17+K17+M17+N17))","v":{"$error":"#VALUE!"}},{"$error":"#VALUE!"},0,0,0,0,0,0,0,{"$error":"#VALUE!"}]
[7,0,{"$error":"#VALUE!"},{"$error":"#VALUE!"},{"$f":"(E17*Simulador!$B$36*$F$3+Simulador!$O$17*(D18+I18+K18+M18+N18))","v":{"$error":"#VALUE!"}},{"$f":"(F17*Simulador!$D$36*$G$3+Simulador!$P$17*(D18+I18+K18+M18+N18))","v":{"$error":"#VALUE!"}},{"$error":"#VALUE!"},0,0,0,0,0,0,0,{"$error":"#VALUE!"}]
[8,0,{"$error":"#VALUE!"},{"$error":"#VALUE!"},{"$f":"(E18*Simulador!$B$36*$F$3+Simulador!$O$17*(D19+I19+K19+M19+N19))","v":{"$error":"#VALUE!"}},{"$f":"(F18*Simulador!$D$36*$G$3+Simulador!$P$17*(D19+I19+K19+M19+N19))","v":{"$error":"#VALUE!"}},{"$error":"#VALUE!"},0,0,0,0,0,0,0,{"$error":"#VALUE!"}]
[9,0,{"$error":"#VALUE!"},{"$error":"#VALUE!"},{"$f":"(E19*Simulador!$B$36*$F$3+Simulador!$O$17*(D20+I20+K20+M20+N20))","v":{"$error":"#VALUE!"}},{"$f":"(F19*Simulador!$D$36*$G$3+Simulador!$P$17*(D20+I20+K20+M20+N20))","v":{"$error":"#VALUE!"}},{"$error":"#VALUE!"},0,0,0,0,0,0,0,{"$error":"#VALUE!"}]
[10,0,{"$error":"#VALUE!"},{"$error":"#VALUE!"},{"$f":"(E20*Simulador!$B$36*$F$3+Simulador!$O$17*(D21+I21+K21+M21+N21))","v":{"$error":"#VALUE!"}},{"$f":"(F20*Simulador!$D$36*$G$3+Simulador!$P$17*(D21+I21+K21+M21+N21))","v":{"$error":"#VALUE!"}},{"$error":"#VALUE!"},0,0,0,0,0,0,0,{"$error":"#VALUE!"}]
[11,0,{"$error":"#VALUE!"},{"$error":"#VALUE!"},{"$f":"(E21*Simulador!$B$36*$F$3+Simulador!$O$17*(D22+I22+K22+M22+N22))","v":{"$error":"#VALUE!"}},{"$f":"(F21*Simulador!$D$36*$G$3+Simulador!$P$17*(D22+I22+K22+M22+N22))","v":{"$error":"#VALUE!"}},{"$error":"#VALUE!"},0,0,0,0,0,0,0,{"$error":"#VALUE!"}]
[12,0,{"$error":"#VALUE!"},{"$error":"#VALUE!"},{"$f":"(E22*Simulador!$B$36*$F$3+Simulador!$O$17*(D23+I23+K23+M23+N23))","v":{"$error":"#VALUE!"}},{"$f":"(F22*Simulador!$D$36*$G$3+Simulador!$P$17*(D23+I23+K23+M23+N23))","v":{"$error":"#VALUE!"}},{"$error":"#VALUE!"},0,0,0,0,0,0,0,{"$error":"#VALUE!"}]
[13,0,{"$error":"#VALUE!"},{"$error":"#VALUE!"},{"$f":"(E23*Simulador!$B$36*$F$3+Simulador!$O$17*(D24+I24+K24+M24+N24))","v":{"$error":"#VALUE!"}},{"$f":"(F23*Simulador!$D$36*$G$3+Simulador!$P$17*(D24+I24+K24+M24+N24))","v":{"$error":"#VALUE!"}},{"$error":"#VALUE!"},0,0,0,0,0,0,0,{"$error":"#VALUE!"}]
[14,0,{"$error":"#VALUE!"},{"$error":"#VALUE!"},{"$f":"(E24*Simulador!$B$36*$F$3+Simulador!$O$17*(D25+I25+K25+M25+N25))","v":{"$error":"#VALUE!"}},{"$f":"(F24*Simulador!$D$36*$G$3+Simulador!$P$17*(D25+I25+K25+M25+N25))","v":{"$error":"#VALUE!"}},{"$error":"#VALUE!"},0,0,0,0,0,0,0,{"$error":"#VALUE!"}]
[15,0,{"$error":"#VALUE!"},{"$error":"#VALUE!"},{"$f":"(E25*Simulador!$B$36*$F$3+Simulador!$O$17*(D26+I26+K26+M26+N26))","v":{"$error":"#VALUE!"}},{"$f":"(F25*Simulador!$D$36*$G$3+Simulador!$P$17*(D26+I26+K26+M26+N26))","v":{"$error":"#VALUE!"}},{"$error":"#VALUE!"},0,0,0,0,0,0,0,{"$error":"#VALUE!"}]
[16,0,{"$error":"#VALUE!"},{"$error":"#VALUE!"},{"$f":"(E26*Simulador!$B$36*$F$3+Simulador!$O$17*(D27+I27+K27+M27+N27))","v":{"$error":"#VALUE!"}},{"$f":"(F26*Simulador!$D$36*$G$3+Simulador!$P$17*(D27+I27+K27+M27+N27))","v":{"$error":"#VALUE!"}},{"$error":"#VALUE!"},0,0,0,0,0,0,0,{"$error":"#VALUE!"}]
[17,0,{"$error":"#VALUE!"},{"$error":"#VALUE!"},{"$f":"(E27*Simulador!$B$36*$F$3+Simulador!$O$17*(D28+I28+K28+M28+N28))","v":{"$error":"#VALUE!"}},{"$f":"(F27*Simulador!$D$36*$G$3+Simulador!$P$17*(D28+I28+K28+M28+N28))","v":{"$error":"#VALUE!"}},{"$error":"#VALUE!"},0,0,0,0,0,0,0,{"$error":"#VALUE!"}]
[18,0,{"$error":"#VALUE!"},{"$error":"#VALUE!"},{"$f":"(E28*Simulador!$B$36*$F$3+Simulador!$O$17*(D29+I29+K29+M29+N29))","v":{"$error":"#VALUE!"}},{"$f":"(F28*Simulador!$D$36*$G$3+Simulador!$P$17*(D29+I29+K29+M29+N29))","v":{"$error":"#VALUE!"}},{"$error":"#VALUE!"},0,0,0,0,0,0,0,{"$error":"#VALUE!"}]
[19,0,{"$error":"#VALUE!"},{"$error":"#VALUE!"},{"$f":"(E29*Simulador!$B$36*$F$3+Simulador!$O$17*(D30+I30+K30+M30+N30))","v":{"$error":"#VALUE!"}},{"$f":"(F29*Simulador!$D$36*$G$3+Simulador!$P$17*(D30+I30+K30+M30+N30))","v":{"$error":"#VALUE!"}},{"$error":"#VALUE!"},0,0,0,0,0,0,0,{"$error":"#VALUE!"}]
{"$rows_left_out":28}
{"sheet":"Cálculo Participante","index":3,"n_rows":36,"n_cols":6,"rows_kept":36,"cut":false,"hidden":false,"merged":[[20,0,20,4],[35,0,35,5]]}
[]
[]
[]
[]
[]
["Data cálculo benefício:",{"$f":"TODAY()","v":"2015-09-11"}]
[]
["Dados do Participante",null,null,{"$f":"+C9-INT(C9)","v":0.69609856262833603}]
["SEXO","MASCULINO",{"$f":"((B6-B10)/365.25)","v":115.69609856262834},null,"Fator Atuarial"]
["Idade",{"$f":"Simulador!J7","v":0},"äx12",{"$f":"VLOOKUP(B10,'Mort Validos-Masc'!A7:G122,7,0)+D8*(VLOOKUP(B10+1,'Mort Validos-Masc'!A7:G122,7,0)-VLOOKUP(B10,'Mort Validos-Masc'!A7:G122,7,0))","v":20.743175282373837},{"$f":"1/(13*D10)","v":3.7083559231378144E-3}]
["Data Nascimento",{"$f":"Simulador!L6","v":"IDADE ATUAL"}]
["Salário de Participação",{"$f":"Simulador!J9","v":0},null,null,"Benefício inicial","Expectativa de Vida"]
["Contribuição Participante",{"$f":"Simulador!H53","v":""},null,null,{"$f":"B18/(13*D10)","v":{"$error":"#VALUE!"}},{"$f":"VLOOKUP(B10,#REF!,9,0)+D8*(VLOOKUP(B10+1,#REF!,9,0)-VLOOKUP(B10,#REF!,9,0))","v":{"$error":"#REF!"}}]
["Contribuição Patrocinadora",{"$f":"Simulador!H55","v":""}]
["Tempo de Vinculação do Plano",null,null,null,"Início Benefício"]
["Saldo da Conta do Participante",null,null,null,{"$f":"B6+ 1","v":"2015-09-12"}]
["Saldo da Conta da Patrocinadora"]
["Saldo Total",{"$f":"Simulador!H61","v":""}]
["Saldo da Conta Total",{"$f":"Simulador!H61","v":""}]
[]
[" Este benefício será recalculado anualmente de acordo com o saldo remanescente e a idade do participante."]
[]
["Dados do Participante",null,null,{"$f":"+C24-INT(C24)","v":0.74948665297741002}]
["SEXO","FEMININO",{"$f":"((\"30/09/2013\"-B25)/365.25)","v":113.74948665297741},null,"Fator Atuarial"]
["Idade",{"$f":"B10","v":0},"äx12",{"$f":"VLOOKUP(B25,'Mort Validos-Fem'!A22:G137,7,0)+D23*(VLOOKUP(B25+1,'Mort Validos-Fem'!A22:G137,7,0)-VLOOKUP(B25,'Mort Validos-Fem'!A22:G137,7,0))","v":{"$error":"#N/A"}},{"$f":"1/(13*D25)","v":{"$error":"#N/A"}}]
["Data Nascimento",{"$f":"B11","v":"IDADE ATUAL"}]
["Salário de Participação",{"$f":"Simulador!J9","v":0},null,null,"Benefício inicial","Expectativa de Vida"]
["Contribuição Participante",{"$f":"Simulador!H53","v":""},null,null,{"$f":"B34/(13*D25)","v":{"$error":"#VALUE!"}},{"$f":"VLOOKUP(B25,#REF!,9,0)+D23*(VLOOKUP(B25+1,#REF!,9,0)-VLOOKUP(B25,#REF!,9,0))","v":{"$error":"#REF!"}}]
["Contribuição Patrocinadora",{"$f":"Simulador!H55","v":""}]
["Tempo de Vinculação do Plano",null,null,null,"Início Benefício"]
{"$rows_left_out":7}
{"sheet":"Mort Validos-Masc","index":4,"n_rows":125,"n_cols":9,"rows_kept":125,"cut":false,"hidden":false,"merged":[[0,0,0,8],[1,0,1,8],[2,0,2,8],[3,0,3,8],[4,0,4,8]]}
["BASES TÉCNICAS"]
["Mortalidade de Válidos:AT-2000 - Masculina"]
["Taxa de Juros - 4,75% aa"]
["Taxa de Morbidez:- Experiência de STEA"]
[]
["IDADE X","Lx","p X","q X","D X","N X","a X","nx","e0x"]
[0,10078012.433814215,0.99768900000000005,2.3109999019652605E-3,10078012.433814215,214016654.01703188,20.735998211210106,3.74604E-3,80.569109113091486]
[1,10054722.147079671,0.99909400000000004,9.0599997201934457E-4,9598779.9615923837,203938641.58321765,20.746308634976291,3.7993909053868E-3,79.753419265012937]
[2,10045612.568814417,0.99949600000000005,5.0399999599903822E-4,9155210.8219387513,194339861.62162527,20.72724046462438,3.8573761510412598E-3,78.824834565128924]
[3,10040549.580079736,0.99959200000000004,4.0799999260343611E-4,8735652.9553412665,185184650.79968652,20.698718830337523,3.9203983001356579E-3,77.8640780604714]
[4,10036453.035851063,0.99964299999999995,3.5700001171790063E-4,8336122.8541157935,176448997.84434524,20.666794315804388,3.9888948845968998E-3,76.89545140464449]
[5,10032870.022117265,0.99967600000000001,3.2399999327026308E-4,7955271.355089074,168112874.99022946,20.632261551667352,4.0633414426764795E-3,75.92255575704975]
[6,10029619.3722301,0.999699,3.009999927598983E-4,7592070.3948110631,160157603.63514039,20.595379166215711,4.1442548203797468E-3,74.946838532734347]
[7,10026600.456799058,0.99971399999999999,2.8599999495781958E-4,7245618.2128618862,152565533.24032933,20.556247894693964,4.2321967596746874E-3,73.969103232807427]
[8,10023732.849068414,0.99967200000000001,3.279999946244061E-4,6915079.5867608599,145319915.02746743,20.514930226643671,4.3277777983913865E-3,72.989978366620278]
[9,10020445.06469392,0.99963800000000003,3.6199999158270657E-4,6599342.5739876376,138404835.44070658,20.47251868485375,4.4316615088872812E-3,72.013598827035551]
[10,10016817.663580501,0.99961,3.9000000106170774E-4,6297807.6581240986,131805492.86671895,20.42878983001194,4.5445691049051679E-3,71.039315059086931]
[11,10012911.104691705,0.999587,4.1300000157207251E-4,6009882.0307068052,125507685.20859484,20.383552217385912,4.6672844486071218E-3,70.066641049096077]
[12,10008775.772405468,0.99956900000000004,4.3099999311380088E-4,5734987.9402276492,119497803.17788804,20.336626758999707,4.8006594925457365E-3,69.095177357344653]
[13,10004461.990047561,0.99955400000000005,4.4599999091587961E-4,5472569.0521619888,113762815.23766039,20.28782636698158,4.9456201943535892E-3,68.124539033668171]
[14,10000000,0.99954200000000004,4.5799999497830868E-4,5222079.4383410783,108290246.1854984,20.236997103188354,5.1031729452137645E-3,67.154489936179701]
[15,9995420,0.99953000000000003,4.6999999904073775E-4,4982995.3743923604,103068166.74715732,20.183978009858322,5.2744115567411234E-3,66.184802575759392]
[16,9990722.1525999997,0.99951900000000005,4.8099999548867345E-4,4754800.2850104375,98085171.37276496,20.128662718385794,5.4605248547808464E-3,65.215453839063755]
[17,9985916.6152445991,0.99950499999999998,4.949999856762588E-4,4537005.4044591542,93330371.087754518,20.070919090381867,5.6628049328442467E-3,64.246356336461588]
[18,9980973.5865200534,0.99948999999999999,5.0999998347833753E-4,4329126.0380480215,88793365.683295369,20.010690819094702,5.8826561224814443E-3,63.277678787461376]
[19,9975883.289990928,0.99947200000000003,5.2800000412389636E-4,4130709.4269005675,84464239.645247355,19.94787732954244,6.1216047428677865E-3,62.309456610332646]
[20,9970616.0236138124,0.99945099999999998,5.4899998940527439E-4,3941315.8529281039,80333530.218346789,19.882413695330957,6.3813096972906297E-3,61.341845104547851]
[21,9965142.1554168481,0.99942699999999995,5.7299999753013253E-4,3760526.9849451804,76392214.365418687,19.814231136020503,6.663573990102702E-3,60.374990974592905]
[22,9959432.1289617941,0.99940099999999998,5.9900002088397741E-4,3587944.7748514037,72631687.380473509,19.743256777407222,6.9703572440986093E-3,59.409032350129529]
[23,9953466.4291165452,0.99937299999999996,6.2700000125914812E-4,3423193.8395819445,69043742.605622113,19.669393216147537,7.3037893052165185E-3,58.444040330287379]
{"$rows_left_out":96}
{"sheet":"Mort Validos-Fem","index":5,"n_rows":125,"n_cols":9,"rows_kept":125,"cut":false,"hidden":false,"merged":[[0,0,0,8],[1,0,1,8],[2,0,2,8],[3,0,3,8],[4,0,4,8]]}
["BASES TÉCNICAS"]
["Mortalidade de Válidos:AT-2000 - Feminina"]
["Taxa de Juros - 4,75% aa"]
["Taxa de Morbidez:- Experiência de STEA"]
[]
["IDADE X","Lx","p X","q X","D X","N X","a X","nx","e0x"]
[0,10048337.912467266,0.99820600000000004,1.7940000398084521E-3,10048337.912467266,215301774.88363594,20.926605749046789,3.74604E-3,84.843800064950173]
[1,10030311.194252299,0.99924500000000005,7.5499998638406396E-4,9575475.9496649336,205253436.97116867,20.935324786999328,3.7993909053868E-3,83.994486173144793]
[2,10022738.309300639,0.99960800000000005,3.9199998718686402E-4,9134364.042629892,195677961.02150375,20.922176750157828,3.8573761510412598E-3,83.057194354882739]
[3,10018809.395883393,0.99970999999999999,2.899999963119626E-4,8716738.18351431,186543596.97887385,20.90061948076837,3.9203983001356579E-3,82.089373389251321]
[4,10015903.941158587,0.99976799999999999,2.3200000578071922E-4,8319055.0934950402,177826858.79535955,20.875848193914305,3.9888948845968998E-3,81.112896129128757]
[5,10013580.251444237,0.99981100000000001,1.8899999849963933E-4,7939976.0946358759,169507803.70186451,20.848654162369751,4.0633414426764795E-3,80.131486634027866]
[6,10011687.684776714,0.99984399999999996,1.55999994603917E-4,7578496.7357925773,161567827.60722864,20.819244863451338,4.1442548203797468E-3,79.146445312191872]
[7,10010125.861497888,0.99986900000000001,1.3099999341648072E-4,7233713.0184464902,153989330.87143606,20.78773017104109,4.2321967596746874E-3,78.158638059729199]
[8,10008814.535010032,0.99986900000000001,1.3099999341648072E-4,6904787.8790141204,146755617.85298958,20.754181942218281,4.3277777983913865E-3,77.168747165607897]
[9,10007503.380305946,0.99986600000000003,1.340000017080456E-4,6590819.3389208047,139850829.97397545,20.719035567871433,4.4316615088872812E-3,76.178726578789721]
[10,10006162.374852985,0.99985999999999997,1.4000000373926014E-4,6291108.4287678869,133260010.63505465,20.682278471896186,4.5445691049051679E-3,75.188801878241406]
[11,10004761.512120506,0.99985199999999996,1.4800000644754618E-4,6004990.5371701969,126968902.20628676,20.643897133619767,4.6672844486071218E-3,74.199189764808466]
[12,10003280.807416711,0.99984200000000001,1.5799999528098851E-4,5731839.3475666586,120963911.66911656,20.603855906301604,4.8006594925457365E-3,73.210024848486057]
[13,10001700.289049139,0.99983,1.6999999934341758E-4,5471058.366286994,115232072.32154989,20.562117163950795,4.9456201943535892E-3,72.221435835348046]
[14,10000000,0.99981699999999996,1.829999964684248E-4,5222079.4383410783,109761013.9552629,20.518641185230834,5.1031729452137645E-3,71.23354553808953]
[15,9998170,0.999803,1.9700000120792538E-4,4984366.3260161616,104538934.51692182,20.473365053703088,5.2744115567411234E-3,70.246400629404704]
[16,9996200.3605099991,0.99978800000000001,2.119999990100041E-4,4757407.4823815534,99554568.19090566,20.426222645336392,5.4605248547808464E-3,69.260044858241784]
[17,9994081.1660335716,0.99977199999999999,2.280000044265762E-4,4540714.8897755044,94797160.708524108,20.377144460662436,5.6628049328442467E-3,68.274519056281719]
[18,9991802.5155277159,0.99975599999999998,2.4399999529123306E-4,4333822.9544484979,90256445.818748608,20.326057447986873,5.8826561224814443E-3,67.289861144622677]
[19,9989364.5157139264,0.99973999999999996,2.6000000070780516E-4,4136291.5918639484,85922622.864300117,20.272864039205846,6.1216047428677865E-3,66.306039818338363]
[20,9986767.2809398398,0.99972300000000003,2.7700001373887062E-4,3947700.3337257826,81786331.272436172,20.217461904016258,6.3813096972906297E-3,65.323023804527551]
[21,9984000.9464030191,0.99970599999999998,2.9399999766610563E-4,3767643.6914909459,77838630.938710392,20.15976438125119,6.663573990102702E-3,64.340846218930196]
[22,9981065.6501247771,0.99968800000000002,3.1199998920783401E-4,3595738.3797691627,74070987.247219443,20.099659770568351,6.9703572440986093E-3,63.359473904258039]
[23,9977951.5576419383,0.99966999999999995,3.3000000985339284E-4,3431614.7592410804,70475248.867450282,20.037051450098161,7.3037893052165185E-3,62.378936132331326]
{"$rows_left_out":96}
{"sheet":"Plan1","index":6,"n_rows":0,"n_cols":0,"rows_kept":0,"cut":false,"hidden":false,"merged":[]}